Android compile error can u help me?

Android compile error can u help me?
0.0 0

#1

jni/…/…/Classes/AppDelegate.cpp: In member function ‘virtual bool AppDelegate:
:applicationDidFinishLaunching()’:
jni/…/…/Classes/AppDelegate.cpp:141:29: error: ‘register_all_cocos2dx_3d’ was
not declared in this scope
sc->addRegisterCallback(register_all_cocos2dx_3d);
^
make: *** [obj/local/armeabi/objs-debug/cocos2d_js_static//auto/jsb_cocos2dx_3
d_auto.o] Error 1
make: *** Waiting for unfinished jobs…
make: *** [obj/local/armeabi/objs-debug/cocos2djs_shared/
/__/Classes/AppDelega
te.o] Error 1
make: Leaving directory `C:/Users/User/Desktop/bidings-example/frameworks/runtim
e-src/proj.android’
Error running command, return code: 2.